{"text_format":"2","workbook":"xlsx","n_sheets":5,"sheets":["整体情况","ORG","P1","P2","P3"],"not_rendered":{"charts":0,"images":0,"macros":0,"external_links":0,"defined_names":25,"comments":0,"pivot_tables":0},"unopened":[],"bounds":{"document_bytes":16777216,"sheet_cells":100000,"run_cost":"one","rows_first":2000,"rows_last":500,"rows_between":2000,"halvings":0,"cell_chars":16384,"cell_head_chars":4096},"cells_cut":0,"cells_raw":0,"read":"whole","date_system":"1900"}

{"sheet":"整体情况","index":0,"n_rows":34,"n_cols":32,"rows_kept":34,"cut":false,"hidden":false,"merged":[[33,0,33,4],[33,7,33,8],[27,0,27,4],[27,7,27,8],[28,0,28,4],[28,7,28,8],[31,0,31,4],[31,7,31,8],[25,0,25,4],[25,7,25,8],[26,0,26,4],[26,7,26,8],[32,0,32,4],[32,7,32,8],[1,0,2,0],[23,0,23,4],[23,7,23,8],[24,0,24,4],[24,7,24,8]]}
["Practice Characterization"]
["Process Areas","Specific Practices",{"$nulls":18},"Generic Practices"]
[null,"SP1.1","SP1.2","SP1.3","SP1.4","SP1.5","SP1.6","SP1.7","SP2.1","SP2.2","SP2.3","SP2.4","SP2.5","SP2.6","SP2.7","SP3.1","SP3.2","SP3.3","SP3.4","SP3.5","GP2.1","GP2.2","GP2.3","GP2.4","GP2.5","GP2.6","GP2.7","GP2.8","GP2.9","GP2.10","GP3.1","GP3.2"]
["REQM",{"$f":"IF(AVERAGE('P1'!B4,'P2'!B4)=0,\"NI\",IF(AVERAGE('P1'!B4,'P2'!B4)=1,\"FI\",\"PI\"))","v":"FI"},{"$f":"IF(AVERAGE('P1'!C4,'P2'!C4)=0,\"NI\",IF(AVERAGE('P1'!C4,'P2'!C4)=1,\"FI\",\"PI\"))","v":"PI"},{"$f":"IF(AVERAGE('P1'!D4,'P2'!D4)=0,\"NI\",IF(AVERAGE('P1'!D4,'P2'!D4)=1,\"FI\",\"PI\"))","v":"PI"},{"$f":"IF(AVERAGE('P1'!E4,'P2'!E4)=0,\"NI\",IF(AVERAGE('P1'!E4,'P2'!E4)=1,\"FI\",\"PI\"))","v":"PI"},{"$f":"IF(AVERAGE('P1'!F4,'P2'!F4)=0,\"NI\",IF(AVERAGE('P1'!F4,'P2'!F4)=1,\"FI\",\"PI\"))","v":"PI"},"---","---","---","---","---","---","---","---","---","---","---","---","---","---",{"$f":"IF(AVERAGE('P1'!U4,'P2'!U4)=0,\"NI\",IF(AVERAGE('P1'!U4,'P2'!U4)=1,\"FI\",\"PI\"))","v":"FI"},{"$f":"IF(AVERAGE('P1'!V4,'P2'!V4)=0,\"NI\",IF(AVERAGE('P1'!V4,'P2'!V4)=1,\"FI\",\"PI\"))","v":"PI"},{"$f":"IF(AVERAGE('P1'!W4,'P2'!W4)=0,\"NI\",IF(AVERAGE('P1'!W4,'P2'!W4)=1,\"FI\",\"PI\"))","v":"PI"},{"$f":"IF(AVERAGE('P1'!X4,'P2'!X4)=0,\"NI\",IF(AVERAGE('P1'!X4,'P2'!X4)=1,\"FI\",\"PI\"))","v":"PI"},{"$f":"IF(AVERAGE('P1'!Y4,'P2'!Y4)=0,\"NI\",IF(AVERAGE('P1'!Y4,'P2'!Y4)=1,\"FI\",\"PI\"))","v":"FI"},{"$f":"IF(AVERAGE('P1'!Z4,'P2'!Z4)=0,\"NI\",IF(AVERAGE('P1'!Z4,'P2'!Z4)=1,\"FI\",\"PI\"))","v":"FI"},{"$f":"IF(AVERAGE('P1'!AA4,'P2'!AA4)=0,\"NI\",IF(AVERAGE('P1'!AA4,'P2'!AA4)=1,\"FI\",\"PI\"))","v":"PI"},{"$f":"IF(AVERAGE('P1'!AB4,'P2'!AB4)=0,\"NI\",IF(AVERAGE('P1'!AB4,'P2'!AB4)=1,\"FI\",\"PI\"))","v":"PI"},{"$f":"IF(AVERAGE('P1'!AC4,'P2'!AC4)=0,\"NI\",IF(AVERAGE('P1'!AC4,'P2'!AC4)=1,\"FI\",\"PI\"))","v":"FI"},{"$f":"IF(AVERAGE('P1'!AD4,'P2'!AD4)=0,\"NI\",IF(AVERAGE('P1'!AD4,'P2'!AD4)=1,\"FI\",\"PI\"))","v":"PI"},{"$f":"IF(AVERAGE('P1'!AE4,'P2'!AE4)=0,\"NI\",IF(AVERAGE('P1'!AE4,'P2'!AE4)=1,\"FI\",\"PI\"))","v":"FI"},{"$f":"IF(AVERAGE('P1'!AF4,'P2'!AF4)=0,\"NI\",IF(AVERAGE('P1'!AF4,'P2'!AF4)=1,\"FI\",\"PI\"))","v":"FI"}]
["PP",{"$f":"IF(AVERAGE('P1'!B5,'P2'!B5)=0,\"NI\",IF(AVERAGE('P1'!B5,'P2'!B5)=1,\"FI\",\"PI\"))","v":"PI"},{"$f":"IF(AVERAGE('P1'!C5,'P2'!C5)=0,\"NI\",IF(AVERAGE('P1'!C5,'P2'!C5)=1,\"FI\",\"PI\"))","v":"PI"},{"$f":"IF(AVERAGE('P1'!D5,'P2'!D5)=0,\"NI\",IF(AVERAGE('P1'!D5,'P2'!D5)=1,\"FI\",\"PI\"))","v":"FI"},{"$f":"IF(AVERAGE('P1'!E5,'P2'!E5)=0,\"NI\",IF(AVERAGE('P1'!E5,'P2'!E5)=1,\"FI\",\"PI\"))","v":"PI"},"---","---","---",{"$f":"IF(AVERAGE('P1'!I5,'P2'!I5)=0,\"NI\",IF(AVERAGE('P1'!I5,'P2'!I5)=1,\"FI\",\"PI\"))","v":"PI"},{"$f":"IF(AVERAGE('P1'!J5,'P2'!J5)=0,\"NI\",IF(AVERAGE('P1'!J5,'P2'!J5)=1,\"FI\",\"PI\"))","v":"FI"},{"$f":"IF(AVERAGE('P1'!K5,'P2'!K5)=0,\"NI\",IF(AVERAGE('P1'!K5,'P2'!K5)=1,\"FI\",\"PI\"))","v":"FI"},{"$f":"IF(AVERAGE('P1'!L5,'P2'!L5)=0,\"NI\",IF(AVERAGE('P1'!L5,'P2'!L5)=1,\"FI\",\"PI\"))","v":"FI"},{"$f":"IF(AVERAGE('P1'!M5,'P2'!M5)=0,\"NI\",IF(AVERAGE('P1'!M5,'P2'!M5)=1,\"FI\",\"PI\"))","v":"FI"},{"$f":"IF(AVERAGE('P1'!N5,'P2'!N5)=0,\"NI\",IF(AVERAGE('P1'!N5,'P2'!N5)=1,\"FI\",\"PI\"))","v":"PI"},{"$f":"IF(AVERAGE('P1'!O5,'P2'!O5)=0,\"NI\",IF(AVERAGE('P1'!O5,'P2'!O5)=1,\"FI\",\"PI\"))","v":"FI"},{"$f":"IF(AVERAGE('P1'!P5,'P2'!P5)=0,\"NI\",IF(AVERAGE('P1'!P5,'P2'!P5)=1,\"FI\",\"PI\"))","v":"PI"},{"$f":"IF(AVERAGE('P1'!Q5,'P2'!Q5)=0,\"NI\",IF(AVERAGE('P1'!Q5,'P2'!Q5)=1,\"FI\",\"PI\"))","v":"FI"},{"$f":"IF(AVERAGE('P1'!R5,'P2'!R5)=0,\"NI\",IF(AVERAGE('P1'!R5,'P2'!R5)=1,\"FI\",\"PI\"))","v":"PI"},"---","---",{"$f":"IF(AVERAGE('P1'!U5,'P2'!U5)=0,\"NI\",IF(AVERAGE('P1'!U5,'P2'!U5)=1,\"FI\",\"PI\"))","v":"FI"},{"$f":"IF(AVERAGE('P1'!V5,'P2'!V5)=0,\"NI\",IF(AVERAGE('P1'!V5,'P2'!V5)=1,\"FI\",\"PI\"))","v":"FI"},{"$f":"IF(AVERAGE('P1'!W5,'P2'!W5)=0,\"NI\",IF(AVERAGE('P1'!W5,'P2'!W5)=1,\"FI\",\"PI\"))","v":"FI"},{"$f":"IF(AVERAGE('P1'!X5,'P2'!X5)=0,\"NI\",IF(AVERAGE('P1'!X5,'P2'!X5)=1,\"FI\",\"PI\"))","v":"FI"},{"$f":"IF(AVERAGE('P1'!Y5,'P2'!Y5)=0,\"NI\",IF(AVERAGE('P1'!Y5,'P2'!Y5)=1,\"FI\",\"PI\"))","v":"FI"},{"$f":"IF(AVERAGE('P1'!Z5,'P2'!Z5)=0,\"NI\",IF(AVERAGE('P1'!Z5,'P2'!Z5)=1,\"FI\",\"PI\"))","v":"FI"},{"$f":"IF(AVERAGE('P1'!AA5,'P2'!AA5)=0,\"NI\",IF(AVERAGE('P1'!AA5,'P2'!AA5)=1,\"FI\",\"PI\"))","v":"PI"},{"$f":"IF(AVERAGE('P1'!AB5,'P2'!AB5)=0,\"NI\",IF(AVERAGE('P1'!AB5,'P2'!AB5)=1,\"FI\",\"PI\"))","v":"PI"},{"$f":"IF(AVERAGE('P1'!AC5,'P2'!AC5)=0,\"NI\",IF(AVERAGE('P1'!AC5,'P2'!AC5)=1,\"FI\",\"PI\"))","v":"FI"},{"$f":"IF(AVERAGE('P1'!AD5,'P2'!AD5)=0,\"NI\",IF(AVERAGE('P1'!AD5,'P2'!AD5)=1,\"FI\",\"PI\"))","v":"PI"},{"$f":"IF(AVERAGE('P1'!AE5,'P2'!AE5)=0,\"NI\",IF(AVERAGE('P1'!AE5,'P2'!AE5)=1,\"FI\",\"PI\"))","v":"FI"},{"$f":"IF(AVERAGE('P1'!AF5,'P2'!AF5)=0,\"NI\",IF(AVERAGE('P1'!AF5,'P2'!AF5)=1,\"FI\",\"PI\"))","v":"FI"}]
["PMC",{"$f":"IF(AVERAGE('P1'!B6,'P2'!B6,'P3'!B6)=0,\"NI\",IF(AVERAGE('P1'!B6,'P2'!B6,'P3'!B6)=1,\"FI\",\"PI\"))","v":"PI"},{"$f":"IF(AVERAGE('P1'!C6,'P2'!C6,'P3'!C6)=0,\"NI\",IF(AVERAGE('P1'!C6,'P2'!C6,'P3'!C6)=1,\"FI\",\"PI\"))","v":"PI"},{"$f":"IF(AVERAGE('P1'!D6,'P2'!D6,'P3'!D6)=0,\"NI\",IF(AVERAGE('P1'!D6,'P2'!D6,'P3'!D6)=1,\"FI\",\"PI\"))","v":"FI"},{"$f":"IF(AVERAGE('P1'!E6,'P2'!E6,'P3'!E6)=0,\"NI\",IF(AVERAGE('P1'!E6,'P2'!E6,'P3'!E6)=1,\"FI\",\"PI\"))","v":"PI"},{"$f":"IF(AVERAGE('P1'!F6,'P2'!F6,'P3'!F6)=0,\"NI\",IF(AVERAGE('P1'!F6,'P2'!F6,'P3'!F6)=1,\"FI\",\"PI\"))","v":"PI"},{"$f":"IF(AVERAGE('P1'!G6,'P2'!G6,'P3'!G6)=0,\"NI\",IF(AVERAGE('P1'!G6,'P2'!G6,'P3'!G6)=1,\"FI\",\"PI\"))","v":"PI"},{"$f":"IF(AVERAGE('P1'!H6,'P2'!H6,'P3'!H6)=0,\"NI\",IF(AVERAGE('P1'!H6,'P2'!H6,'P3'!H6)=1,\"FI\",\"PI\"))","v":"PI"},{"$f":"IF(AVERAGE('P1'!I6,'P2'!I6,'P3'!I6)=0,\"NI\",IF(AVERAGE('P1'!I6,'P2'!I6,'P3'!I6)=1,\"FI\",\"PI\"))","v":"PI"},{"$f":"IF(AVERAGE('P1'!J6,'P2'!J6,'P3'!J6)=0,\"NI\",IF(AVERAGE('P1'!J6,'P2'!J6,'P3'!J6)=1,\"FI\",\"PI\"))","v":"PI"},{"$f":"IF(AVERAGE('P1'!K6,'P2'!K6,'P3'!K6)=0,\"NI\",IF(AVERAGE('P1'!K6,'P2'!K6,'P3'!K6)=1,\"FI\",\"PI\"))","v":"PI"},"---","---","---","---","---","---","---","---","---",{"$f":"IF(AVERAGE('P1'!U6,'P2'!U6)=0,\"NI\",IF(AVERAGE('P1'!U6,'P2'!U6)=1,\"FI\",\"PI\"))","v":"FI"},{"$f":"IF(AVERAGE('P1'!V6,'P2'!V6)=0,\"NI\",IF(AVERAGE('P1'!V6,'P2'!V6)=1,\"FI\",\"PI\"))","v":"PI"},{"$f":"IF(AVERAGE('P1'!W6,'P2'!W6)=0,\"NI\",IF(AVERAGE('P1'!W6,'P2'!W6)=1,\"FI\",\"PI\"))","v":"PI"},{"$f":"IF(AVERAGE('P1'!X6,'P2'!X6)=0,\"NI\",IF(AVERAGE('P1'!X6,'P2'!X6)=1,\"FI\",\"PI\"))","v":"PI"},{"$f":"IF(AVERAGE('P1'!Y6,'P2'!Y6)=0,\"NI\",IF(AVERAGE('P1'!Y6,'P2'!Y6)=1,\"FI\",\"PI\"))","v":"FI"},{"$f":"IF(AVERAGE('P1'!Z6,'P2'!Z6)=0,\"NI\",IF(AVERAGE('P1'!Z6,'P2'!Z6)=1,\"FI\",\"PI\"))","v":"PI"},{"$f":"IF(AVERAGE('P1'!AA6,'P2'!AA6)=0,\"NI\",IF(AVERAGE('P1'!AA6,'P2'!AA6)=1,\"FI\",\"PI\"))","v":"PI"},{"$f":"IF(AVERAGE('P1'!AB6,'P2'!AB6)=0,\"NI\",IF(AVERAGE('P1'!AB6,'P2'!AB6)=1,\"FI\",\"PI\"))","v":"PI"},{"$f":"IF(AVERAGE('P1'!AC6,'P2'!AC6)=0,\"NI\",IF(AVERAGE('P1'!AC6,'P2'!AC6)=1,\"FI\",\"PI\"))","v":"FI"},{"$f":"IF(AVERAGE('P1'!AD6,'P2'!AD6)=0,\"NI\",IF(AVERAGE('P1'!AD6,'P2'!AD6)=1,\"FI\",\"PI\"))","v":"PI"},{"$f":"IF(AVERAGE('P1'!AE6,'P2'!AE6)=0,\"NI\",IF(AVERAGE('P1'!AE6,'P2'!AE6)=1,\"FI\",\"PI\"))","v":"FI"},{"$f":"IF(AVERAGE('P1'!AF6,'P2'!AF6)=0,\"NI\",IF(AVERAGE('P1'!AF6,'P2'!AF6)=1,\"FI\",\"PI\"))","v":"FI"}]
["SAM","/","/","/","---","---","---","---","/","/","/","---","---","---","---","---","---","---","---","---","/","/","/","/","/","/","/","/","/","/","/","/"]
["MA",{"$f":"IF(AVERAGE('P1'!B8,'P2'!B8)=0,\"NI\",IF(AVERAGE('P1'!B8,'P2'!B8)=1,\"FI\",\"PI\"))","v":"FI"},{"$f":"IF(AVERAGE('P1'!C8,'P2'!C8)=0,\"NI\",IF(AVERAGE('P1'!C8,'P2'!C8)=1,\"FI\",\"PI\"))","v":"FI"},{"$f":"IF(AVERAGE('P1'!D8,'P2'!D8)=0,\"NI\",IF(AVERAGE('P1'!D8,'P2'!D8)=1,\"FI\",\"PI\"))","v":"FI"},{"$f":"IF(AVERAGE('P1'!E8,'P2'!E8)=0,\"NI\",IF(AVERAGE('P1'!E8,'P2'!E8)=1,\"FI\",\"PI\"))","v":"FI"},"---","---","---",{"$f":"IF(AVERAGE('P1'!I8,'P2'!I8)=0,\"NI\",IF(AVERAGE('P1'!I8,'P2'!I8)=1,\"FI\",\"PI\"))","v":"PI"},{"$f":"IF(AVERAGE('P1'!J8,'P2'!J8)=0,\"NI\",IF(AVERAGE('P1'!J8,'P2'!J8)=1,\"FI\",\"PI\"))","v":"PI"},{"$f":"IF(AVERAGE('P1'!K8,'P2'!K8)=0,\"NI\",IF(AVERAGE('P1'!K8,'P2'!K8)=1,\"FI\",\"PI\"))","v":"PI"},{"$f":"IF(AVERAGE('P1'!L8,'P2'!L8)=0,\"NI\",IF(AVERAGE('P1'!L8,'P2'!L8)=1,\"FI\",\"PI\"))","v":"PI"},"---","---","---","---","---","---","---","---",{"$f":"IF(AVERAGE('P1'!U8,'P2'!U8)=0,\"NI\",IF(AVERAGE('P1'!U8,'P2'!U8)=1,\"FI\",\"PI\"))","v":"FI"},{"$f":"IF(AVERAGE('P1'!V8,'P2'!V8)=0,\"NI\",IF(AVERAGE('P1'!V8,'P2'!V8)=1,\"FI\",\"PI\"))","v":"PI"},{"$f":"IF(AVERAGE('P1'!W8,'P2'!W8)=0,\"NI\",IF(AVERAGE('P1'!W8,'P2'!W8)=1,\"FI\",\"PI\"))","v":"PI"},{"$f":"IF(AVERAGE('P1'!X8,'P2'!X8)=0,\"NI\",IF(AVERAGE('P1'!X8,'P2'!X8)=1,\"FI\",\"PI\"))","v":"PI"},{"$f":"IF(AVERAGE('P1'!Y8,'P2'!Y8)=0,\"NI\",IF(AVERAGE('P1'!Y8,'P2'!Y8)=1,\"FI\",\"PI\"))","v":"FI"},{"$f":"IF(AVERAGE('P1'!Z8,'P2'!Z8)=0,\"NI\",IF(AVERAGE('P1'!Z8,'P2'!Z8)=1,\"FI\",\"PI\"))","v":"PI"},{"$f":"IF(AVERAGE('P1'!AA8,'P2'!AA8)=0,\"NI\",IF(AVERAGE('P1'!AA8,'P2'!AA8)=1,\"FI\",\"PI\"))","v":"PI"},{"$f":"IF(AVERAGE('P1'!AB8,'P2'!AB8)=0,\"NI\",IF(AVERAGE('P1'!AB8,'P2'!AB8)=1,\"FI\",\"PI\"))","v":"PI"},{"$f":"IF(AVERAGE('P1'!AC8,'P2'!AC8)=0,\"NI\",IF(AVERAGE('P1'!AC8,'P2'!AC8)=1,\"FI\",\"PI\"))","v":"FI"},{"$f":"IF(AVERAGE('P1'!AD8,'P2'!AD8)=0,\"NI\",IF(AVERAGE('P1'!AD8,'P2'!AD8)=1,\"FI\",\"PI\"))","v":"PI"},{"$f":"IF(AVERAGE('P1'!AE8,'P2'!AE8)=0,\"NI\",IF(AVERAGE('P1'!AE8,'P2'!AE8)=1,\"FI\",\"PI\"))","v":"FI"},{"$f":"IF(AVERAGE('P1'!AF8,'P2'!AF8)=0,\"NI\",IF(AVERAGE('P1'!AF8,'P2'!AF8)=1,\"FI\",\"PI\"))","v":"FI"}]
["PPQA",{"$f":"IF(AVERAGE('P1'!B9,'P2'!B9)=0,\"NI\",IF(AVERAGE('P1'!B9,'P2'!B9)=1,\"FI\",\"PI\"))","v":"FI"},{"$f":"IF(AVERAGE('P1'!C9,'P2'!C9)=0,\"NI\",IF(AVERAGE('P1'!C9,'P2'!C9)=1,\"FI\",\"PI\"))","v":"FI"},"---","---","---","---","---",{"$f":"IF(AVERAGE('P1'!I9,'P2'!I9)=0,\"NI\",IF(AVERAGE('P1'!I9,'P2'!I9)=1,\"FI\",\"PI\"))","v":"FI"},{"$f":"IF(AVERAGE('P1'!J9,'P2'!J9)=0,\"NI\",IF(AVERAGE('P1'!J9,'P2'!J9)=1,\"FI\",\"PI\"))","v":"FI"},"---","---","---","---","---","---","---","---","---","---",{"$f":"IF(AVERAGE('P1'!U9,'P2'!U9)=0,\"NI\",IF(AVERAGE('P1'!U9,'P2'!U9)=1,\"FI\",\"PI\"))","v":"FI"},{"$f":"IF(AVERAGE('P1'!V9,'P2'!V9)=0,\"NI\",IF(AVERAGE('P1'!V9,'P2'!V9)=1,\"FI\",\"PI\"))","v":"FI"},{"$f":"IF(AVERAGE('P1'!W9,'P2'!W9)=0,\"NI\",IF(AVERAGE('P1'!W9,'P2'!W9)=1,\"FI\",\"PI\"))","v":"FI"},{"$f":"IF(AVERAGE('P1'!X9,'P2'!X9)=0,\"NI\",IF(AVERAGE('P1'!X9,'P2'!X9)=1,\"FI\",\"PI\"))","v":"FI"},{"$f":"IF(AVERAGE('P1'!Y9,'P2'!Y9)=0,\"NI\",IF(AVERAGE('P1'!Y9,'P2'!Y9)=1,\"FI\",\"PI\"))","v":"FI"},{"$f":"IF(AVERAGE('P1'!Z9,'P2'!Z9)=0,\"NI\",IF(AVERAGE('P1'!Z9,'P2'!Z9)=1,\"FI\",\"PI\"))","v":"FI"},{"$f":"IF(AVERAGE('P1'!AA9,'P2'!AA9)=0,\"NI\",IF(AVERAGE('P1'!AA9,'P2'!AA9)=1,\"FI\",\"PI\"))","v":"FI"},{"$f":"IF(AVERAGE('P1'!AB9,'P2'!AB9)=0,\"NI\",IF(AVERAGE('P1'!AB9,'P2'!AB9)=1,\"FI\",\"PI\"))","v":"FI"},{"$f":"IF(AVERAGE('P1'!AC9,'P2'!AC9)=0,\"NI\",IF(AVERAGE('P1'!AC9,'P2'!AC9)=1,\"FI\",\"PI\"))","v":"FI"},{"$f":"IF(AVERAGE('P1'!AD9,'P2'!AD9)=0,\"NI\",IF(AVERAGE('P1'!AD9,'P2'!AD9)=1,\"FI\",\"PI\"))","v":"PI"},{"$f":"IF(AVERAGE('P1'!AE9,'P2'!AE9)=0,\"NI\",IF(AVERAGE('P1'!AE9,'P2'!AE9)=1,\"FI\",\"PI\"))","v":"FI"},{"$f":"IF(AVERAGE('P1'!AF9,'P2'!AF9)=0,\"NI\",IF(AVERAGE('P1'!AF9,'P2'!AF9)=1,\"FI\",\"PI\"))","v":"FI"}]
["CM",{"$f":"IF(AVERAGE('P1'!B10,'P2'!B10)=0,\"NI\",IF(AVERAGE('P1'!B10,'P2'!B10)=1,\"FI\",\"PI\"))","v":"FI"},{"$f":"IF(AVERAGE('P1'!C10,'P2'!C10)=0,\"NI\",IF(AVERAGE('P1'!C10,'P2'!C10)=1,\"FI\",\"PI\"))","v":"FI"},{"$f":"IF(AVERAGE('P1'!D10,'P2'!D10)=0,\"NI\",IF(AVERAGE('P1'!D10,'P2'!D10)=1,\"FI\",\"PI\"))","v":"PI"},"---","---","---","---",{"$f":"IF(AVERAGE('P1'!I10,'P2'!I10)=0,\"NI\",IF(AVERAGE('P1'!I10,'P2'!I10)=1,\"FI\",\"PI\"))","v":"FI"},{"$f":"IF(AVERAGE('P1'!J10,'P2'!J10)=0,\"NI\",IF(AVERAGE('P1'!J10,'P2'!J10)=1,\"FI\",\"PI\"))","v":"PI"},"---","---","---","---","---",{"$f":"IF(AVERAGE('P1'!P10,'P2'!P10)=0,\"NI\",IF(AVERAGE('P1'!P10,'P2'!P10)=1,\"FI\",\"PI\"))","v":"PI"},{"$f":"IF(AVERAGE('P1'!Q10,'P2'!Q10)=0,\"NI\",IF(AVERAGE('P1'!Q10,'P2'!Q10)=1,\"FI\",\"PI\"))","v":"PI"},"---","---","---",{"$f":"IF(AVERAGE('P1'!U10,'P2'!U10)=0,\"NI\",IF(AVERAGE('P1'!U10,'P2'!U10)=1,\"FI\",\"PI\"))","v":"FI"},{"$f":"IF(AVERAGE('P1'!V10,'P2'!V10)=0,\"NI\",IF(AVERAGE('P1'!V10,'P2'!V10)=1,\"FI\",\"PI\"))","v":"PI"},{"$f":"IF(AVERAGE('P1'!W10,'P2'!W10)=0,\"NI\",IF(AVERAGE('P1'!W10,'P2'!W10)=1,\"FI\",\"PI\"))","v":"PI"},{"$f":"IF(AVERAGE('P1'!X10,'P2'!X10)=0,\"NI\",IF(AVERAGE('P1'!X10,'P2'!X10)=1,\"FI\",\"PI\"))","v":"PI"},{"$f":"IF(AVERAGE('P1'!Y10,'P2'!Y10)=0,\"NI\",IF(AVERAGE('P1'!Y10,'P2'!Y10)=1,\"FI\",\"PI\"))","v":"FI"},{"$f":"IF(AVERAGE('P1'!Z10,'P2'!Z10)=0,\"NI\",IF(AVERAGE('P1'!Z10,'P2'!Z10)=1,\"FI\",\"PI\"))","v":"PI"},{"$f":"IF(AVERAGE('P1'!AA10,'P2'!AA10)=0,\"NI\",IF(AVERAGE('P1'!AA10,'P2'!AA10)=1,\"FI\",\"PI\"))","v":"PI"},{"$f":"IF(AVERAGE('P1'!AB10,'P2'!AB10)=0,\"NI\",IF(AVERAGE('P1'!AB10,'P2'!AB10)=1,\"FI\",\"PI\"))","v":"PI"},{"$f":"IF(AVERAGE('P1'!AC10,'P2'!AC10)=0,\"NI\",IF(AVERAGE('P1'!AC10,'P2'!AC10)=1,\"FI\",\"PI\"))","v":"FI"},{"$f":"IF(AVERAGE('P1'!AD10,'P2'!AD10)=0,\"NI\",IF(AVERAGE('P1'!AD10,'P2'!AD10)=1,\"FI\",\"PI\"))","v":"PI"},{"$f":"IF(AVERAGE('P1'!AE10,'P2'!AE10)=0,\"NI\",IF(AVERAGE('P1'!AE10,'P2'!AE10)=1,\"FI\",\"PI\"))","v":"FI"},{"$f":"IF(AVERAGE('P1'!AF10,'P2'!AF10)=0,\"NI\",IF(AVERAGE('P1'!AF10,'P2'!AF10)=1,\"FI\",\"PI\"))","v":"FI"}]
["RD",{"$f":"IF(AVERAGE('P1'!B11,'P2'!B11)=0,\"NI\",IF(AVERAGE('P1'!B11,'P2'!B11)=1,\"FI\",\"PI\"))","v":"FI"},{"$f":"IF(AVERAGE('P1'!C11,'P2'!C11)=0,\"NI\",IF(AVERAGE('P1'!C11,'P2'!C11)=1,\"FI\",\"PI\"))","v":"FI"},"---","---","---","---","---",{"$f":"IF(AVERAGE('P1'!I11,'P2'!I11)=0,\"NI\",IF(AVERAGE('P1'!I11,'P2'!I11)=1,\"FI\",\"PI\"))","v":"FI"},{"$f":"IF(AVERAGE('P1'!J11,'P2'!J11)=0,\"NI\",IF(AVERAGE('P1'!J11,'P2'!J11)=1,\"FI\",\"PI\"))","v":"FI"},{"$f":"IF(AVERAGE('P1'!K11,'P2'!K11)=0,\"NI\",IF(AVERAGE('P1'!K11,'P2'!K11)=1,\"FI\",\"PI\"))","v":"FI"},"---","---","---","---",{"$f":"IF(AVERAGE('P1'!P11,'P2'!P11)=0,\"NI\",IF(AVERAGE('P1'!P11,'P2'!P11)=1,\"FI\",\"PI\"))","v":"FI"},{"$f":"IF(AVERAGE('P1'!Q11,'P2'!Q11)=0,\"NI\",IF(AVERAGE('P1'!Q11,'P2'!Q11)=1,\"FI\",\"PI\"))","v":"FI"},{"$f":"IF(AVERAGE('P1'!R11,'P2'!R11)=0,\"NI\",IF(AVERAGE('P1'!R11,'P2'!R11)=1,\"FI\",\"PI\"))","v":"PI"},{"$f":"IF(AVERAGE('P1'!S11,'P2'!S11)=0,\"NI\",IF(AVERAGE('P1'!S11,'P2'!S11)=1,\"FI\",\"PI\"))","v":"PI"},{"$f":"IF(AVERAGE('P1'!T11,'P2'!T11)=0,\"NI\",IF(AVERAGE('P1'!T11,'P2'!T11)=1,\"FI\",\"PI\"))","v":"PI"},{"$f":"IF(AVERAGE('P1'!U11,'P2'!U11)=0,\"NI\",IF(AVERAGE('P1'!U11,'P2'!U11)=1,\"FI\",\"PI\"))","v":"FI"},{"$f":"IF(AVERAGE('P1'!V11,'P2'!V11)=0,\"NI\",IF(AVERAGE('P1'!V11,'P2'!V11)=1,\"FI\",\"PI\"))","v":"PI"},{"$f":"IF(AVERAGE('P1'!W11,'P2'!W11)=0,\"NI\",IF(AVERAGE('P1'!W11,'P2'!W11)=1,\"FI\",\"PI\"))","v":"PI"},{"$f":"IF(AVERAGE('P1'!X11,'P2'!X11)=0,\"NI\",IF(AVERAGE('P1'!X11,'P2'!X11)=1,\"FI\",\"PI\"))","v":"PI"},{"$f":"IF(AVERAGE('P1'!Y11,'P2'!Y11)=0,\"NI\",IF(AVERAGE('P1'!Y11,'P2'!Y11)=1,\"FI\",\"PI\"))","v":"FI"},{"$f":"IF(AVERAGE('P1'!Z11,'P2'!Z11)=0,\"NI\",IF(AVERAGE('P1'!Z11,'P2'!Z11)=1,\"FI\",\"PI\"))","v":"PI"},{"$f":"IF(AVERAGE('P1'!AA11,'P2'!AA11)=0,\"NI\",IF(AVERAGE('P1'!AA11,'P2'!AA11)=1,\"FI\",\"PI\"))","v":"PI"},{"$f":"IF(AVERAGE('P1'!AB11,'P2'!AB11)=0,\"NI\",IF(AVERAGE('P1'!AB11,'P2'!AB11)=1,\"FI\",\"PI\"))","v":"PI"},{"$f":"IF(AVERAGE('P1'!AC11,'P2'!AC11)=0,\"NI\",IF(AVERAGE('P1'!AC11,'P2'!AC11)=1,\"FI\",\"PI\"))","v":"FI"},{"$f":"IF(AVERAGE('P1'!AD11,'P2'!AD11)=0,\"NI\",IF(AVERAGE('P1'!AD11,'P2'!AD11)=1,\"FI\",\"PI\"))","v":"PI"},{"$f":"IF(AVERAGE('P1'!AE11,'P2'!AE11)=0,\"NI\",IF(AVERAGE('P1'!AE11,'P2'!AE11)=1,\"FI\",\"PI\"))","v":"FI"},{"$f":"IF(AVERAGE('P1'!AF11,'P2'!AF11)=0,\"NI\",IF(AVERAGE('P1'!AF11,'P2'!AF11)=1,\"FI\",\"PI\"))","v":"FI"}]
["TS",{"$f":"IF(AVERAGE('P1'!B12,'P2'!B12)=0,\"NI\",IF(AVERAGE('P1'!B12,'P2'!B12)=1,\"FI\",\"PI\"))","v":"PI"},{"$f":"IF(AVERAGE('P1'!C12,'P2'!C12)=0,\"NI\",IF(AVERAGE('P1'!C12,'P2'!C12)=1,\"FI\",\"PI\"))","v":"PI"},"---","---","---","---","---",{"$f":"IF(AVERAGE('P1'!I12,'P2'!I12)=0,\"NI\",IF(AVERAGE('P1'!I12,'P2'!I12)=1,\"FI\",\"PI\"))","v":"FI"},{"$f":"IF(AVERAGE('P1'!J12,'P2'!J12)=0,\"NI\",IF(AVERAGE('P1'!J12,'P2'!J12)=1,\"FI\",\"PI\"))","v":"FI"},{"$f":"IF(AVERAGE('P1'!K12,'P2'!K12)=0,\"NI\",IF(AVERAGE('P1'!K12,'P2'!K12)=1,\"FI\",\"PI\"))","v":"FI"},{"$f":"IF(AVERAGE('P1'!L12,'P2'!L12)=0,\"NI\",IF(AVERAGE('P1'!L12,'P2'!L12)=1,\"FI\",\"PI\"))","v":"FI"},"---","---","---",{"$f":"IF(AVERAGE('P1'!P12,'P2'!P12)=0,\"NI\",IF(AVERAGE('P1'!P12,'P2'!P12)=1,\"FI\",\"PI\"))","v":"FI"},{"$f":"IF(AVERAGE('P1'!Q12,'P2'!Q12)=0,\"NI\",IF(AVERAGE('P1'!Q12,'P2'!Q12)=1,\"FI\",\"PI\"))","v":"FI"},"---","---","---",{"$f":"IF(AVERAGE('P1'!U12,'P2'!U12)=0,\"NI\",IF(AVERAGE('P1'!U12,'P2'!U12)=1,\"FI\",\"PI\"))","v":"FI"},{"$f":"IF(AVERAGE('P1'!V12,'P2'!V12)=0,\"NI\",IF(AVERAGE('P1'!V12,'P2'!V12)=1,\"FI\",\"PI\"))","v":"PI"},{"$f":"IF(AVERAGE('P1'!W12,'P2'!W12)=0,\"NI\",IF(AVERAGE('P1'!W12,'P2'!W12)=1,\"FI\",\"PI\"))","v":"PI"},{"$f":"IF(AVERAGE('P1'!X12,'P2'!X12)=0,\"NI\",IF(AVERAGE('P1'!X12,'P2'!X12)=1,\"FI\",\"PI\"))","v":"PI"},{"$f":"IF(AVERAGE('P1'!Y12,'P2'!Y12)=0,\"NI\",IF(AVERAGE('P1'!Y12,'P2'!Y12)=1,\"FI\",\"PI\"))","v":"FI"},{"$f":"IF(AVERAGE('P1'!Z12,'P2'!Z12)=0,\"NI\",IF(AVERAGE('P1'!Z12,'P2'!Z12)=1,\"FI\",\"PI\"))","v":"PI"},{"$f":"IF(AVERAGE('P1'!AA12,'P2'!AA12)=0,\"NI\",IF(AVERAGE('P1'!AA12,'P2'!AA12)=1,\"FI\",\"PI\"))","v":"PI"},{"$f":"IF(AVERAGE('P1'!AB12,'P2'!AB12)=0,\"NI\",IF(AVERAGE('P1'!AB12,'P2'!AB12)=1,\"FI\",\"PI\"))","v":"PI"},{"$f":"IF(AVERAGE('P1'!AC12,'P2'!AC12)=0,\"NI\",IF(AVERAGE('P1'!AC12,'P2'!AC12)=1,\"FI\",\"PI\"))","v":"FI"},{"$f":"IF(AVERAGE('P1'!AD12,'P2'!AD12)=0,\"NI\",IF(AVERAGE('P1'!AD12,'P2'!AD12)=1,\"FI\",\"PI\"))","v":"PI"},{"$f":"IF(AVERAGE('P1'!AE12,'P2'!AE12)=0,\"NI\",IF(AVERAGE('P1'!AE12,'P2'!AE12)=1,\"FI\",\"PI\"))","v":"FI"},{"$f":"IF(AVERAGE('P1'!AF12,'P2'!AF12)=0,\"NI\",IF(AVERAGE('P1'!AF12,'P2'!AF12)=1,\"FI\",\"PI\"))","v":"FI"}]
["PI",{"$f":"IF(AVERAGE('P1'!B13,'P2'!B13)=0,\"NI\",IF(AVERAGE('P1'!B13,'P2'!B13)=1,\"FI\",\"PI\"))","v":"FI"},{"$f":"IF(AVERAGE('P1'!C13,'P2'!C13)=0,\"NI\",IF(AVERAGE('P1'!C13,'P2'!C13)=1,\"FI\",\"PI\"))","v":"FI"},{"$f":"IF(AVERAGE('P1'!D13,'P2'!D13)=0,\"NI\",IF(AVERAGE('P1'!D13,'P2'!D13)=1,\"FI\",\"PI\"))","v":"FI"},"---","---","---","---",{"$f":"IF(AVERAGE('P1'!I13,'P2'!I13)=0,\"NI\",IF(AVERAGE('P1'!I13,'P2'!I13)=1,\"FI\",\"PI\"))","v":"PI"},{"$f":"IF(AVERAGE('P1'!J13,'P2'!J13)=0,\"NI\",IF(AVERAGE('P1'!J13,'P2'!J13)=1,\"FI\",\"PI\"))","v":"PI"},"---","---","---","---","---",{"$f":"IF(AVERAGE('P1'!P13,'P2'!P13)=0,\"NI\",IF(AVERAGE('P1'!P13,'P2'!P13)=1,\"FI\",\"PI\"))","v":"PI"},{"$f":"IF(AVERAGE('P1'!Q13,'P2'!Q13)=0,\"NI\",IF(AVERAGE('P1'!Q13,'P2'!Q13)=1,\"FI\",\"PI\"))","v":"PI"},{"$f":"IF(AVERAGE('P1'!R13,'P2'!R13)=0,\"NI\",IF(AVERAGE('P1'!R13,'P2'!R13)=1,\"FI\",\"PI\"))","v":"PI"},{"$f":"IF(AVERAGE('P1'!S13,'P2'!S13)=0,\"NI\",IF(AVERAGE('P1'!S13,'P2'!S13)=1,\"FI\",\"PI\"))","v":"FI"},"---",{"$f":"IF(AVERAGE('P1'!U13,'P2'!U13)=0,\"NI\",IF(AVERAGE('P1'!U13,'P2'!U13)=1,\"FI\",\"PI\"))","v":"FI"},{"$f":"IF(AVERAGE('P1'!V13,'P2'!V13)=0,\"NI\",IF(AVERAGE('P1'!V13,'P2'!V13)=1,\"FI\",\"PI\"))","v":"PI"},{"$f":"IF(AVERAGE('P1'!W13,'P2'!W13)=0,\"NI\",IF(AVERAGE('P1'!W13,'P2'!W13)=1,\"FI\",\"PI\"))","v":"PI"},{"$f":"IF(AVERAGE('P1'!X13,'P2'!X13)=0,\"NI\",IF(AVERAGE('P1'!X13,'P2'!X13)=1,\"FI\",\"PI\"))","v":"PI"},{"$f":"IF(AVERAGE('P1'!Y13,'P2'!Y13)=0,\"NI\",IF(AVERAGE('P1'!Y13,'P2'!Y13)=1,\"FI\",\"PI\"))","v":"FI"},{"$f":"IF(AVERAGE('P1'!Z13,'P2'!Z13)=0,\"NI\",IF(AVERAGE('P1'!Z13,'P2'!Z13)=1,\"FI\",\"PI\"))","v":"PI"},{"$f":"IF(AVERAGE('P1'!AA13,'P2'!AA13)=0,\"NI\",IF(AVERAGE('P1'!AA13,'P2'!AA13)=1,\"FI\",\"PI\"))","v":"PI"},{"$f":"IF(AVERAGE('P1'!AB13,'P2'!AB13)=0,\"NI\",IF(AVERAGE('P1'!AB13,'P2'!AB13)=1,\"FI\",\"PI\"))","v":"PI"},{"$f":"IF(AVERAGE('P1'!AC13,'P2'!AC13)=0,\"NI\",IF(AVERAGE('P1'!AC13,'P2'!AC13)=1,\"FI\",\"PI\"))","v":"FI"},{"$f":"IF(AVERAGE('P1'!AD13,'P2'!AD13)=0,\"NI\",IF(AVERAGE('P1'!AD13,'P2'!AD13)=1,\"FI\",\"PI\"))","v":"PI"},{"$f":"IF(AVERAGE('P1'!AE13,'P2'!AE13)=0,\"NI\",IF(AVERAGE('P1'!AE13,'P2'!AE13)=1,\"FI\",\"PI\"))","v":"FI"},{"$f":"IF(AVERAGE('P1'!AF13,'P2'!AF13)=0,\"NI\",IF(AVERAGE('P1'!AF13,'P2'!AF13)=1,\"FI\",\"PI\"))","v":"FI"}]
["VER",{"$f":"IF(AVERAGE('P1'!B14,'P2'!B14)=0,\"NI\",IF(AVERAGE('P1'!B14,'P2'!B14)=1,\"FI\",\"PI\"))","v":"FI"},{"$f":"IF(AVERAGE('P1'!C14,'P2'!C14)=0,\"NI\",IF(AVERAGE('P1'!C14,'P2'!C14)=1,\"FI\",\"PI\"))","v":"FI"},{"$f":"IF(AVERAGE('P1'!D14,'P2'!D14)=0,\"NI\",IF(AVERAGE('P1'!D14,'P2'!D14)=1,\"FI\",\"PI\"))","v":"FI"},"---","---","---","---",{"$f":"IF(AVERAGE('P1'!I14,'P2'!I14)=0,\"NI\",IF(AVERAGE('P1'!I14,'P2'!I14)=1,\"FI\",\"PI\"))","v":"PI"},{"$f":"IF(AVERAGE('P1'!J14,'P2'!J14)=0,\"NI\",IF(AVERAGE('P1'!J14,'P2'!J14)=1,\"FI\",\"PI\"))","v":"PI"},{"$f":"IF(AVERAGE('P1'!K14,'P2'!K14)=0,\"NI\",IF(AVERAGE('P1'!K14,'P2'!K14)=1,\"FI\",\"PI\"))","v":"PI"},"---","---","---","---",{"$f":"IF(AVERAGE('P1'!P14,'P2'!P14)=0,\"NI\",IF(AVERAGE('P1'!P14,'P2'!P14)=1,\"FI\",\"PI\"))","v":"PI"},{"$f":"IF(AVERAGE('P1'!Q14,'P2'!Q14)=0,\"NI\",IF(AVERAGE('P1'!Q14,'P2'!Q14)=1,\"FI\",\"PI\"))","v":"NI"},"---","---","---",{"$f":"IF(AVERAGE('P1'!U14,'P2'!U14)=0,\"NI\",IF(AVERAGE('P1'!U14,'P2'!U14)=1,\"FI\",\"PI\"))","v":"FI"},{"$f":"IF(AVERAGE('P1'!V14,'P2'!V14)=0,\"NI\",IF(AVERAGE('P1'!V14,'P2'!V14)=1,\"FI\",\"PI\"))","v":"PI"},{"$f":"IF(AVERAGE('P1'!W14,'P2'!W14)=0,\"NI\",IF(AVERAGE('P1'!W14,'P2'!W14)=1,\"FI\",\"PI\"))","v":"PI"},{"$f":"IF(AVERAGE('P1'!X14,'P2'!X14)=0,\"NI\",IF(AVERAGE('P1'!X14,'P2'!X14)=1,\"FI\",\"PI\"))","v":"PI"},{"$f":"IF(AVERAGE('P1'!Y14,'P2'!Y14)=0,\"NI\",IF(AVERAGE('P1'!Y14,'P2'!Y14)=1,\"FI\",\"PI\"))","v":"FI"},{"$f":"IF(AVERAGE('P1'!Z14,'P2'!Z14)=0,\"NI\",IF(AVERAGE('P1'!Z14,'P2'!Z14)=1,\"FI\",\"PI\"))","v":"PI"},{"$f":"IF(AVERAGE('P1'!AA14,'P2'!AA14)=0,\"NI\",IF(AVERAGE('P1'!AA14,'P2'!AA14)=1,\"FI\",\"PI\"))","v":"PI"},{"$f":"IF(AVERAGE('P1'!AB14,'P2'!AB14)=0,\"NI\",IF(AVERAGE('P1'!AB14,'P2'!AB14)=1,\"FI\",\"PI\"))","v":"PI"},{"$f":"IF(AVERAGE('P1'!AC14,'P2'!AC14)=0,\"NI\",IF(AVERAGE('P1'!AC14,'P2'!AC14)=1,\"FI\",\"PI\"))","v":"FI"},{"$f":"IF(AVERAGE('P1'!AD14,'P2'!AD14)=0,\"NI\",IF(AVERAGE('P1'!AD14,'P2'!AD14)=1,\"FI\",\"PI\"))","v":"PI"},{"$f":"IF(AVERAGE('P1'!AE14,'P2'!AE14)=0,\"NI\",IF(AVERAGE('P1'!AE14,'P2'!AE14)=1,\"FI\",\"PI\"))","v":"FI"},{"$f":"IF(AVERAGE('P1'!AF14,'P2'!AF14)=0,\"NI\",IF(AVERAGE('P1'!AF14,'P2'!AF14)=1,\"FI\",\"PI\"))","v":"FI"}]
["VAL",{"$f":"IF(AVERAGE('P1'!B15,'P2'!B15)=0,\"NI\",IF(AVERAGE('P1'!B15,'P2'!B15)=1,\"FI\",\"PI\"))","v":"FI"},{"$f":"IF(AVERAGE('P1'!C15,'P2'!C15)=0,\"NI\",IF(AVERAGE('P1'!C15,'P2'!C15)=1,\"FI\",\"PI\"))","v":"FI"},{"$f":"IF(AVERAGE('P1'!D15,'P2'!D15)=0,\"NI\",IF(AVERAGE('P1'!D15,'P2'!D15)=1,\"FI\",\"PI\"))","v":"NI"},"---","---","---","---",{"$f":"IF(AVERAGE('P1'!I15,'P2'!I15)=0,\"NI\",IF(AVERAGE('P1'!I15,'P2'!I15)=1,\"FI\",\"PI\"))","v":"NI"},{"$f":"IF(AVERAGE('P1'!J15,'P2'!J15)=0,\"NI\",IF(AVERAGE('P1'!J15,'P2'!J15)=1,\"FI\",\"PI\"))","v":"NI"},"---","---","---","---","---","---","---","---","---","---",{"$f":"IF(AVERAGE('P1'!U15,'P2'!U15)=0,\"NI\",IF(AVERAGE('P1'!U15,'P2'!U15)=1,\"FI\",\"PI\"))","v":"FI"},{"$f":"IF(AVERAGE('P1'!V15,'P2'!V15)=0,\"NI\",IF(AVERAGE('P1'!V15,'P2'!V15)=1,\"FI\",\"PI\"))","v":"PI"},{"$f":"IF(AVERAGE('P1'!W15,'P2'!W15)=0,\"NI\",IF(AVERAGE('P1'!W15,'P2'!W15)=1,\"FI\",\"PI\"))","v":"PI"},{"$f":"IF(AVERAGE('P1'!X15,'P2'!X15)=0,\"NI\",IF(AVERAGE('P1'!X15,'P2'!X15)=1,\"FI\",\"PI\"))","v":"PI"},{"$f":"IF(AVERAGE('P1'!Y15,'P2'!Y15)=0,\"NI\",IF(AVERAGE('P1'!Y15,'P2'!Y15)=1,\"FI\",\"PI\"))","v":"FI"},{"$f":"IF(AVERAGE('P1'!Z15,'P2'!Z15)=0,\"NI\",IF(AVERAGE('P1'!Z15,'P2'!Z15)=1,\"FI\",\"PI\"))","v":"PI"},{"$f":"IF(AVERAGE('P1'!AA15,'P2'!AA15)=0,\"NI\",IF(AVERAGE('P1'!AA15,'P2'!AA15)=1,\"FI\",\"PI\"))","v":"PI"},{"$f":"IF(AVERAGE('P1'!AB15,'P2'!AB15)=0,\"NI\",IF(AVERAGE('P1'!AB15,'P2'!AB15)=1,\"FI\",\"PI\"))","v":"PI"},{"$f":"IF(AVERAGE('P1'!AC15,'P2'!AC15)=0,\"NI\",IF(AVERAGE('P1'!AC15,'P2'!AC15)=1,\"FI\",\"PI\"))","v":"FI"},{"$f":"IF(AVERAGE('P1'!AD15,'P2'!AD15)=0,\"NI\",IF(AVERAGE('P1'!AD15,'P2'!AD15)=1,\"FI\",\"PI\"))","v":"PI"},{"$f":"IF(AVERAGE('P1'!AE15,'P2'!AE15)=0,\"NI\",IF(AVERAGE('P1'!AE15,'P2'!AE15)=1,\"FI\",\"PI\"))","v":"FI"},{"$f":"IF(AVERAGE('P1'!AF15,'P2'!AF15)=0,\"NI\",IF(AVERAGE('P1'!AF15,'P2'!AF15)=1,\"FI\",\"PI\"))","v":"FI"}]
["OPF",{"$f":"IF(ORG!B16=0,\"NI\",IF(ORG!B16=1,\"FI\",\"PI\"))","v":"FI"},{"$f":"IF(ORG!C16=0,\"NI\",IF(ORG!C16=1,\"FI\",\"PI\"))","v":"FI"},{"$f":"IF(ORG!D16=0,\"NI\",IF(ORG!D16=1,\"FI\",\"PI\"))","v":"FI"},"---","---","---","---",{"$f":"IF(ORG!I16=0,\"NI\",IF(ORG!I16=1,\"FI\",\"PI\"))","v":"FI"},{"$f":"IF(ORG!J16=0,\"NI\",IF(ORG!J16=1,\"FI\",\"PI\"))","v":"FI"},"---","---","---","---","---",{"$f":"IF(ORG!P16=0,\"NI\",IF(ORG!P16=1,\"FI\",\"PI\"))","v":"FI"},{"$f":"IF(ORG!Q16=0,\"NI\",IF(ORG!Q16=1,\"FI\",\"PI\"))","v":"FI"},{"$f":"IF(ORG!R16=0,\"NI\",IF(ORG!R16=1,\"FI\",\"PI\"))","v":"FI"},{"$f":"IF(ORG!S16=0,\"NI\",IF(ORG!S16=1,\"FI\",\"PI\"))","v":"PI"},"---",{"$f":"IF(ORG!U16=0,\"NI\",IF(ORG!U16=1,\"FI\",\"PI\"))","v":"FI"},{"$f":"IF(ORG!V16=0,\"NI\",IF(ORG!V16=1,\"FI\",\"PI\"))","v":"FI"},{"$f":"IF(ORG!W16=0,\"NI\",IF(ORG!W16=1,\"FI\",\"PI\"))","v":"FI"},{"$f":"IF(ORG!X16=0,\"NI\",IF(ORG!X16=1,\"FI\",\"PI\"))","v":"FI"},{"$f":"IF(ORG!Y16=0,\"NI\",IF(ORG!Y16=1,\"FI\",\"PI\"))","v":"FI"},{"$f":"IF(ORG!Z16=0,\"NI\",IF(ORG!Z16=1,\"FI\",\"PI\"))","v":"FI"},{"$f":"IF(ORG!AA16=0,\"NI\",IF(ORG!AA16=1,\"FI\",\"PI\"))","v":"FI"},{"$f":"IF(ORG!AB16=0,\"NI\",IF(ORG!AB16=1,\"FI\",\"PI\"))","v":"FI"},{"$f":"IF(ORG!AC16=0,\"NI\",IF(ORG!AC16=1,\"FI\",\"PI\"))","v":"FI"},{"$f":"IF(ORG!AD16=0,\"NI\",IF(ORG!AD16=1,\"FI\",\"PI\"))","v":"PI"},{"$f":"IF(ORG!AE16=0,\"NI\",IF(ORG!AE16=1,\"FI\",\"PI\"))","v":"FI"},{"$f":"IF(ORG!AF16=0,\"NI\",IF(ORG!AF16=1,\"FI\",\"PI\"))","v":"PI"}]
["OPD",{"$f":"IF(ORG!B17=0,\"NI\",IF(ORG!B17=1,\"FI\",\"PI\"))","v":"FI"},{"$f":"IF(ORG!C17=0,\"NI\",IF(ORG!C17=1,\"FI\",\"PI\"))","v":"FI"},{"$f":"IF(ORG!D17=0,\"NI\",IF(ORG!D17=1,\"FI\",\"PI\"))","v":"FI"},{"$f":"IF(ORG!E17=0,\"NI\",IF(ORG!E17=1,\"FI\",\"PI\"))","v":"PI"},{"$f":"IF(ORG!F17=0,\"NI\",IF(ORG!F17=1,\"FI\",\"PI\"))","v":"PI"},{"$f":"IF(ORG!G17=0,\"NI\",IF(ORG!G17=1,\"FI\",\"PI\"))","v":"FI"},{"$f":"IF(ORG!H17=0,\"NI\",IF(ORG!H17=1,\"FI\",\"PI\"))","v":"FI"},"---","---","---","---","---","---","---","---","---","---","---","---",{"$f":"IF(ORG!U17=0,\"NI\",IF(ORG!U17=1,\"FI\",\"PI\"))","v":"FI"},{"$f":"IF(ORG!V17=0,\"NI\",IF(ORG!V17=1,\"FI\",\"PI\"))","v":"FI"},{"$f":"IF(ORG!W17=0,\"NI\",IF(ORG!W17=1,\"FI\",\"PI\"))","v":"FI"},{"$f":"IF(ORG!X17=0,\"NI\",IF(ORG!X17=1,\"FI\",\"PI\"))","v":"FI"},{"$f":"IF(ORG!Y17=0,\"NI\",IF(ORG!Y17=1,\"FI\",\"PI\"))","v":"FI"},{"$f":"IF(ORG!Z17=0,\"NI\",IF(ORG!Z17=1,\"FI\",\"PI\"))","v":"FI"},{"$f":"IF(ORG!AA17=0,\"NI\",IF(ORG!AA17=1,\"FI\",\"PI\"))","v":"FI"},{"$f":"IF(ORG!AB17=0,\"NI\",IF(ORG!AB17=1,\"FI\",\"PI\"))","v":"FI"},{"$f":"IF(ORG!AC17=0,\"NI\",IF(ORG!AC17=1,\"FI\",\"PI\"))","v":"FI"},{"$f":"IF(ORG!AD17=0,\"NI\",IF(ORG!AD17=1,\"FI\",\"PI\"))","v":"PI"},{"$f":"IF(ORG!AE17=0,\"NI\",IF(ORG!AE17=1,\"FI\",\"PI\"))","v":"FI"},{"$f":"IF(ORG!AF17=0,\"NI\",IF(ORG!AF17=1,\"FI\",\"PI\"))","v":"PI"}]
["OT",{"$f":"IF(ORG!B18=0,\"NI\",IF(ORG!B18=1,\"FI\",\"PI\"))","v":"FI"},{"$f":"IF(ORG!C18=0,\"NI\",IF(ORG!C18=1,\"FI\",\"PI\"))","v":"FI"},{"$f":"IF(ORG!D18=0,\"NI\",IF(ORG!D18=1,\"FI\",\"PI\"))","v":"FI"},{"$f":"IF(ORG!E18=0,\"NI\",IF(ORG!E18=1,\"FI\",\"PI\"))","v":"FI"},"---","---","---",{"$f":"IF(ORG!I18=0,\"NI\",IF(ORG!I18=1,\"FI\",\"PI\"))","v":"FI"},{"$f":"IF(ORG!J18=0,\"NI\",IF(ORG!J18=1,\"FI\",\"PI\"))","v":"FI"},{"$f":"IF(ORG!K18=0,\"NI\",IF(ORG!K18=1,\"FI\",\"PI\"))","v":"FI"},"---","---","---","---","---","---","---","---","---",{"$f":"IF(ORG!U18=0,\"NI\",IF(ORG!U18=1,\"FI\",\"PI\"))","v":"FI"},{"$f":"IF(ORG!V18=0,\"NI\",IF(ORG!V18=1,\"FI\",\"PI\"))","v":"FI"},{"$f":"IF(ORG!W18=0,\"NI\",IF(ORG!W18=1,\"FI\",\"PI\"))","v":"FI"},{"$f":"IF(ORG!X18=0,\"NI\",IF(ORG!X18=1,\"FI\",\"PI\"))","v":"FI"},{"$f":"IF(ORG!Y18=0,\"NI\",IF(ORG!Y18=1,\"FI\",\"PI\"))","v":"FI"},{"$f":"IF(ORG!Z18=0,\"NI\",IF(ORG!Z18=1,\"FI\",\"PI\"))","v":"FI"},{"$f":"IF(ORG!AA18=0,\"NI\",IF(ORG!AA18=1,\"FI\",\"PI\"))","v":"FI"},{"$f":"IF(ORG!AB18=0,\"NI\",IF(ORG!AB18=1,\"FI\",\"PI\"))","v":"FI"},{"$f":"IF(ORG!AC18=0,\"NI\",IF(ORG!AC18=1,\"FI\",\"PI\"))","v":"FI"},{"$f":"IF(ORG!AD18=0,\"NI\",IF(ORG!AD18=1,\"FI\",\"PI\"))","v":"PI"},{"$f":"IF(ORG!AE18=0,\"NI\",IF(ORG!AE18=1,\"FI\",\"PI\"))","v":"FI"},{"$f":"IF(ORG!AF18=0,\"NI\",IF(ORG!AF18=1,\"FI\",\"PI\"))","v":"PI"}]
["IPM",{"$f":"IF(AVERAGE('P1'!B19,'P2'!B19)=0,\"NI\",IF(AVERAGE('P1'!B19,'P2'!B19)=1,\"FI\",\"PI\"))","v":"FI"},{"$f":"IF(AVERAGE('P1'!C19,'P2'!C19)=0,\"NI\",IF(AVERAGE('P1'!C19,'P2'!C19)=1,\"FI\",\"PI\"))","v":"FI"},{"$f":"IF(AVERAGE('P1'!D19,'P2'!D19)=0,\"NI\",IF(AVERAGE('P1'!D19,'P2'!D19)=1,\"FI\",\"PI\"))","v":"FI"},{"$f":"IF(AVERAGE('P1'!E19,'P2'!E19)=0,\"NI\",IF(AVERAGE('P1'!E19,'P2'!E19)=1,\"FI\",\"PI\"))","v":"FI"},{"$f":"IF(AVERAGE('P1'!F19,'P2'!F19)=0,\"NI\",IF(AVERAGE('P1'!F19,'P2'!F19)=1,\"FI\",\"PI\"))","v":"PI"},{"$f":"IF(AVERAGE('P1'!G19,'P2'!G19)=0,\"NI\",IF(AVERAGE('P1'!G19,'P2'!G19)=1,\"FI\",\"PI\"))","v":"FI"},{"$f":"IF(AVERAGE('P1'!H19,'P2'!H19)=0,\"NI\",IF(AVERAGE('P1'!H19,'P2'!H19)=1,\"FI\",\"PI\"))","v":"NI"},{"$f":"IF(AVERAGE('P1'!I19,'P2'!I19)=0,\"NI\",IF(AVERAGE('P1'!I19,'P2'!I19)=1,\"FI\",\"PI\"))","v":"FI"},{"$f":"IF(AVERAGE('P1'!J19,'P2'!J19)=0,\"NI\",IF(AVERAGE('P1'!J19,'P2'!J19)=1,\"FI\",\"PI\"))","v":"FI"},{"$f":"IF(AVERAGE('P1'!K19,'P2'!K19)=0,\"NI\",IF(AVERAGE('P1'!K19,'P2'!K19)=1,\"FI\",\"PI\"))","v":"FI"},"---","---","---","---","---","---","---","---","---",{"$f":"IF(AVERAGE('P1'!U19,'P2'!U19)=0,\"NI\",IF(AVERAGE('P1'!U19,'P2'!U19)=1,\"FI\",\"PI\"))","v":"FI"},{"$f":"IF(AVERAGE('P1'!V19,'P2'!V19)=0,\"NI\",IF(AVERAGE('P1'!V19,'P2'!V19)=1,\"FI\",\"PI\"))","v":"PI"},{"$f":"IF(AVERAGE('P1'!W19,'P2'!W19)=0,\"NI\",IF(AVERAGE('P1'!W19,'P2'!W19)=1,\"FI\",\"PI\"))","v":"PI"},{"$f":"IF(AVERAGE('P1'!X19,'P2'!X19)=0,\"NI\",IF(AVERAGE('P1'!X19,'P2'!X19)=1,\"FI\",\"PI\"))","v":"PI"},{"$f":"IF(AVERAGE('P1'!Y19,'P2'!Y19)=0,\"NI\",IF(AVERAGE('P1'!Y19,'P2'!Y19)=1,\"FI\",\"PI\"))","v":"FI"},{"$f":"IF(AVERAGE('P1'!Z19,'P2'!Z19)=0,\"NI\",IF(AVERAGE('P1'!Z19,'P2'!Z19)=1,\"FI\",\"PI\"))","v":"PI"},{"$f":"IF(AVERAGE('P1'!AA19,'P2'!AA19)=0,\"NI\",IF(AVERAGE('P1'!AA19,'P2'!AA19)=1,\"FI\",\"PI\"))","v":"PI"},{"$f":"IF(AVERAGE('P1'!AB19,'P2'!AB19)=0,\"NI\",IF(AVERAGE('P1'!AB19,'P2'!AB19)=1,\"FI\",\"PI\"))","v":"PI"},{"$f":"IF(AVERAGE('P1'!AC19,'P2'!AC19)=0,\"NI\",IF(AVERAGE('P1'!AC19,'P2'!AC19)=1,\"FI\",\"PI\"))","v":"FI"},{"$f":"IF(AVERAGE('P1'!AD19,'P2'!AD19)=0,\"NI\",IF(AVERAGE('P1'!AD19,'P2'!AD19)=1,\"FI\",\"PI\"))","v":"PI"},{"$f":"IF(AVERAGE('P1'!AE19,'P2'!AE19)=0,\"NI\",IF(AVERAGE('P1'!AE19,'P2'!AE19)=1,\"FI\",\"PI\"))","v":"FI"},{"$f":"IF(AVERAGE('P1'!AF19,'P2'!AF19)=0,\"NI\",IF(AVERAGE('P1'!AF19,'P2'!AF19)=1,\"FI\",\"PI\"))","v":"FI"}]
["RSKM",{"$f":"IF(AVERAGE('P1'!B20,'P2'!B20)=0,\"NI\",IF(AVERAGE('P1'!B20,'P2'!B20)=1,\"FI\",\"PI\"))","v":"FI"},{"$f":"IF(AVERAGE('P1'!C20,'P2'!C20)=0,\"NI\",IF(AVERAGE('P1'!C20,'P2'!C20)=1,\"FI\",\"PI\"))","v":"FI"},{"$f":"IF(AVERAGE('P1'!D20,'P2'!D20)=0,\"NI\",IF(AVERAGE('P1'!D20,'P2'!D20)=1,\"FI\",\"PI\"))","v":"FI"},"---","---","---","---",{"$f":"IF(AVERAGE('P1'!I20,'P2'!I20)=0,\"NI\",IF(AVERAGE('P1'!I20,'P2'!I20)=1,\"FI\",\"PI\"))","v":"FI"},{"$f":"IF(AVERAGE('P1'!J20,'P2'!J20)=0,\"NI\",IF(AVERAGE('P1'!J20,'P2'!J20)=1,\"FI\",\"PI\"))","v":"FI"},"---","---","---","---","---",{"$f":"IF(AVERAGE('P1'!P20,'P2'!P20)=0,\"NI\",IF(AVERAGE('P1'!P20,'P2'!P20)=1,\"FI\",\"PI\"))","v":"FI"},{"$f":"IF(AVERAGE('P1'!Q20,'P2'!Q20)=0,\"NI\",IF(AVERAGE('P1'!Q20,'P2'!Q20)=1,\"FI\",\"PI\"))","v":"FI"},"---","---","---",{"$f":"IF(AVERAGE('P1'!U20,'P2'!U20)=0,\"NI\",IF(AVERAGE('P1'!U20,'P2'!U20)=1,\"FI\",\"PI\"))","v":"FI"},{"$f":"IF(AVERAGE('P1'!V20,'P2'!V20)=0,\"NI\",IF(AVERAGE('P1'!V20,'P2'!V20)=1,\"FI\",\"PI\"))","v":"PI"},{"$f":"IF(AVERAGE('P1'!W20,'P2'!W20)=0,\"NI\",IF(AVERAGE('P1'!W20,'P2'!W20)=1,\"FI\",\"PI\"))","v":"PI"},{"$f":"IF(AVERAGE('P1'!X20,'P2'!X20)=0,\"NI\",IF(AVERAGE('P1'!X20,'P2'!X20)=1,\"FI\",\"PI\"))","v":"PI"},{"$f":"IF(AVERAGE('P1'!Y20,'P2'!Y20)=0,\"NI\",IF(AVERAGE('P1'!Y20,'P2'!Y20)=1,\"FI\",\"PI\"))","v":"FI"},{"$f":"IF(AVERAGE('P1'!Z20,'P2'!Z20)=0,\"NI\",IF(AVERAGE('P1'!Z20,'P2'!Z20)=1,\"FI\",\"PI\"))","v":"PI"},{"$f":"IF(AVERAGE('P1'!AA20,'P2'!AA20)=0,\"NI\",IF(AVERAGE('P1'!AA20,'P2'!AA20)=1,\"FI\",\"PI\"))","v":"PI"},{"$f":"IF(AVERAGE('P1'!AB20,'P2'!AB20)=0,\"NI\",IF(AVERAGE('P1'!AB20,'P2'!AB20)=1,\"FI\",\"PI\"))","v":"PI"},{"$f":"IF(AVERAGE('P1'!AC20,'P2'!AC20)=0,\"NI\",IF(AVERAGE('P1'!AC20,'P2'!AC20)=1,\"FI\",\"PI\"))","v":"FI"},{"$f":"IF(AVERAGE('P1'!AD20,'P2'!AD20)=0,\"NI\",IF(AVERAGE('P1'!AD20,'P2'!AD20)=1,\"FI\",\"PI\"))","v":"PI"},{"$f":"IF(AVERAGE('P1'!AE20,'P2'!AE20)=0,\"NI\",IF(AVERAGE('P1'!AE20,'P2'!AE20)=1,\"FI\",\"PI\"))","v":"FI"},{"$f":"IF(AVERAGE('P1'!AF20,'P2'!AF20)=0,\"NI\",IF(AVERAGE('P1'!AF20,'P2'!AF20)=1,\"FI\",\"PI\"))","v":"FI"}]
["DAR",{"$f":"IF(AVERAGE('P1'!B21,'P2'!B21)=0,\"NI\",IF(AVERAGE('P1'!B21,'P2'!B21)=1,\"FI\",\"PI\"))","v":"FI"},{"$f":"IF(AVERAGE('P1'!C21,'P2'!C21)=0,\"NI\",IF(AVERAGE('P1'!C21,'P2'!C21)=1,\"FI\",\"PI\"))","v":"PI"},{"$f":"IF(AVERAGE('P1'!D21,'P2'!D21)=0,\"NI\",IF(AVERAGE('P1'!D21,'P2'!D21)=1,\"FI\",\"PI\"))","v":"PI"},{"$f":"IF(AVERAGE('P1'!E21,'P2'!E21)=0,\"NI\",IF(AVERAGE('P1'!E21,'P2'!E21)=1,\"FI\",\"PI\"))","v":"PI"},{"$f":"IF(AVERAGE('P1'!F21,'P2'!F21)=0,\"NI\",IF(AVERAGE('P1'!F21,'P2'!F21)=1,\"FI\",\"PI\"))","v":"PI"},{"$f":"IF(AVERAGE('P1'!G21,'P2'!G21)=0,\"NI\",IF(AVERAGE('P1'!G21,'P2'!G21)=1,\"FI\",\"PI\"))","v":"PI"},"---","---","---","---","---","---","---","---","---","---","---","---","---",{"$f":"IF(AVERAGE('P1'!U21,'P2'!U21)=0,\"NI\",IF(AVERAGE('P1'!U21,'P2'!U21)=1,\"FI\",\"PI\"))","v":"FI"},{"$f":"IF(AVERAGE('P1'!V21,'P2'!V21)=0,\"NI\",IF(AVERAGE('P1'!V21,'P2'!V21)=1,\"FI\",\"PI\"))","v":"PI"},{"$f":"IF(AVERAGE('P1'!W21,'P2'!W21)=0,\"NI\",IF(AVERAGE('P1'!W21,'P2'!W21)=1,\"FI\",\"PI\"))","v":"PI"},{"$f":"IF(AVERAGE('P1'!X21,'P2'!X21)=0,\"NI\",IF(AVERAGE('P1'!X21,'P2'!X21)=1,\"FI\",\"PI\"))","v":"PI"},{"$f":"IF(AVERAGE('P1'!Y21,'P2'!Y21)=0,\"NI\",IF(AVERAGE('P1'!Y21,'P2'!Y21)=1,\"FI\",\"PI\"))","v":"FI"},{"$f":"IF(AVERAGE('P1'!Z21,'P2'!Z21)=0,\"NI\",IF(AVERAGE('P1'!Z21,'P2'!Z21)=1,\"FI\",\"PI\"))","v":"PI"},{"$f":"IF(AVERAGE('P1'!AA21,'P2'!AA21)=0,\"NI\",IF(AVERAGE('P1'!AA21,'P2'!AA21)=1,\"FI\",\"PI\"))","v":"PI"},{"$f":"IF(AVERAGE('P1'!AB21,'P2'!AB21)=0,\"NI\",IF(AVERAGE('P1'!AB21,'P2'!AB21)=1,\"FI\",\"PI\"))","v":"PI"},{"$f":"IF(AVERAGE('P1'!AC21,'P2'!AC21)=0,\"NI\",IF(AVERAGE('P1'!AC21,'P2'!AC21)=1,\"FI\",\"PI\"))","v":"FI"},{"$f":"IF(AVERAGE('P1'!AD21,'P2'!AD21)=0,\"NI\",IF(AVERAGE('P1'!AD21,'P2'!AD21)=1,\"FI\",\"PI\"))","v":"PI"},{"$f":"IF(AVERAGE('P1'!AE21,'P2'!AE21)=0,\"NI\",IF(AVERAGE('P1'!AE21,'P2'!AE21)=1,\"FI\",\"PI\"))","v":"FI"},{"$f":"IF(AVERAGE('P1'!AF21,'P2'!AF21)=0,\"NI\",IF(AVERAGE('P1'!AF21,'P2'!AF21)=1,\"FI\",\"PI\"))","v":"FI"}]
[]
["SP&GP:",{"$nulls":11},"强项："]
["Fully Implemented",{"$nulls":4},"FI",{"$f":"COUNTIF($B$4:$AF$21,F24)","v":189},{"$f":"G24/SUM(G$24:G$26)","v":0.55917159763313606},{"$nulls":5},"1、","项目开发过程中客户与上级领导的参与度高，通过定期会议与项目组沟通。"]
["Partially Implemented",{"$nulls":4},"PI",{"$f":"COUNTIF($B$4:$AF$21,F25)","v":144},{"$f":"G25/SUM(G$24:G$26)","v":0.42603550295857989}]
["Not Implemented",{"$nulls":4},"NI",{"$f":"COUNTIF($B$4:$AF$21,F26)","v":5},{"$f":"G26/SUM(G$24:G$26)","v":1.4792899408284023E-2}]
["Not Yet",{"$nulls":4},"/","/","/"]
["Not Rated",{"$nulls":4},"/","/","/",{"$nulls":4},"弱项："]
["No Practice",{"$nulls":4},"/","/","/",{"$nulls":5},"1、","组织级工作监控力度较弱，上级领导关注度不够；"]
[{"$nulls":13},"2、","验收活动管控较少，可能影响后期维护工作；"]
["SP:",{"$nulls":12},"3、","部分项目测试环节薄弱，可能影响产品质量；"]
["Fully Implemented",{"$nulls":4},"FI",{"$f":"COUNTIF($B$4:$T$21,F32)","v":78},{"$f":"G32/SUM(G$32:G$34)","v":0.58208955223880599},{"$nulls":5},"4、","部分项目策划和监控偏工程类任务，管理和支持类任务较少。"]
["Partially Implemented",{"$nulls":4},"PI",{"$f":"COUNTIF($B$4:$T$21,F33)","v":51},{"$f":"G33/SUM(G$32:G$34)","v":0.38059701492537312}]
["Not Implemented",{"$nulls":4},"NI",{"$f":"COUNTIF($B$4:$T$21,F34)","v":5},{"$f":"G34/SUM(G$32:G$34)","v":3.7313432835820892E-2}]

{"sheet":"ORG","index":1,"n_rows":37,"n_cols":32,"rows_kept":37,"cut":false,"hidden":false,"merged":[[36,0,36,4],[36,7,36,8],[33,0,33,4],[33,7,33,8],[34,0,34,4],[34,7,34,8],[35,0,35,4],[35,7,35,8],[28,0,28,4],[28,7,28,8],[31,0,31,4],[31,7,31,8],[32,0,32,4],[32,7,32,8],[25,0,25,4],[25,7,25,8],[26,0,26,4],[26,7,26,8],[27,0,27,4],[27,7,27,8],[1,0,2,0],[23,0,23,4],[23,7,23,8],[24,0,24,4],[24,7,24,8]]}
["Practice Characterization"]
["Process Areas","Specific Practices",{"$nulls":18},"Generic Practices"]
[null,"SP1.1","SP1.2","SP1.3","SP1.4","SP1.5","SP1.6","SP1.7","SP2.1","SP2.2","SP2.3","SP2.4","SP2.5","SP2.6","SP2.7","SP3.1","SP3.2","SP3.3","SP3.4","SP3.5","GP2.1","GP2.2","GP2.3","GP2.4","GP2.5","GP2.6","GP2.7","GP2.8","GP2.9","GP2.10","GP3.1","GP3.2"]
["REQM","/","/","/","/","/","---","---","---","---","---","---","---","---","---","---","---","---","---","---","/","/","/","/","/","/","/","/","/","/","/","/"]
["PP","/","/","/","/","---","---","---","/","/","/","/","/","/","/","/","/","/","---","---","/","/","/","/","/","/","/","/","/","/","/","/"]
["PMC","/","/","/","/","/","/","/","/","/","/","---","---","---","---","---","---","---","---","---","/","/","/","/","/","/","/","/","/","/","/","/"]
["SAM","/","/","/","---","---","---","---","/","/","/","---","---","---","---","---","---","---","---","---","/","/","/","/","/","/","/","/","/","/","/","/"]
["MA","/","/","/","/","---","---","---","/","/","/","/","---","---","---","---","---","---","---","---","/","/","/","/","/","/","/","/","/","/","/","/"]
["PPQA","/","/","---","---","---","---","---","/","/","---","---","---","---","---","---","---","---","---","---","/","/","/","/","/","/","/","/","/","/","/","/"]
["CM","/","/","/","---","---","---","---","/","/","---","---","---","---","---","/","/","---","---","---","/","/","/","/","/","/","/","/","/","/","/","/"]
["RD","/","/","---","---","---","---","---","/","/","/","---","---","---","---","/","/","/","/","/","/","/","/","/","/","/","/","/","/","/","/","/"]
["TS","/","/","---","---","---","---","---","/","/","/","/","---","---","---","/","/","---","---","---","/","/","/","/","/","/","/","/","/","/","/","/"]
["PI","/","/","/","---","---","---","---","/","/","---","---","---","---","---","/","/","/","/","---","/","/","/","/","/","/","/","/","/","/","/","/"]
["VER","/","/","/","---","---","---","---","/","/","/","---","---","---","---","/","/","---","---","---","/","/","/","/","/","/","/","/","/","/","/","/"]
["VAL","/","/","/","---","---","---","---","/","/","---","---","---","---","---","---","---","---","---","---","/","/","/","/","/","/","/","/","/","/","/","/"]
["OPF",1,1,1,"---","---","---","---",1,1,"---","---","---","---","---",1,1,1,0.5,"---",1,1,1,1,1,1,1,1,1,0.5,1,0.5]
["OPD",1,1,1,0.5,0.5,1,1,"---","---","---","---","---","---","---","---","---","---","---","---",1,1,1,1,1,1,1,1,1,0.5,1,0.5]
["OT",1,1,1,1,"---","---","---",1,1,1,"---","---","---","---","---","---","---","---","---",1,1,1,1,1,1,1,1,1,0.5,1,0.5]
["IPM","/","/","/","/","/","/","/","/","/","/","---","---","---","---","---","---","---","---","---","/","/","/","/","/","/","/","/","/","/","/","/"]
["RSKM","/","/","/","---","---","---","---","/","/","---","---","---","---","---","/","/","---","---","---","/","/","/","/","/","/","/","/","/","/","/","/"]
["DAR","/","/","/","/","/","/","---","---","---","---","---","---","---","---","---","---","---","---","---","/","/","/","/","/","/","/","/","/","/","/","/"]
[]
["SP&GP:",{"$nulls":11},"说明：此页为组织级预评估情况。"]
["等级",{"$nulls":4},"分值","个数","占比"]
["完全满足要求",{"$nulls":4},1,{"$f":"COUNTIF($B$4:$AF$21,F25)","v":50},{"$f":"G25/SUM(G$25:G$27)","v":0.84745762711864403}]
["部分满足要求",{"$nulls":4},0.5,{"$f":"COUNTIF($B$4:$AF$21,F26)","v":9},{"$f":"G26/SUM(G$25:G$27)","v":0.15254237288135594}]
["不满足要求",{"$nulls":4},0,{"$f":"COUNTIF($B$4:$AF$21,F27)","v":0},{"$f":"G27/SUM(G$25:G$27)","v":0}]
["尚未开始",{"$nulls":4},"NY","/","/"]
["非本次评估范围",{"$nulls":4},"/","/","/"]
[]
["SP:"]
["等级",{"$nulls":4},"分值","个数","占比"]
["完全满足要求",{"$nulls":4},1,{"$f":"COUNTIF($B$4:$T$21,F33)","v":20},{"$f":"G33/SUM(G$33:G$36)","v":0.86956521739130432}]
["部分满足要求",{"$nulls":4},0.5,{"$f":"COUNTIF($B$4:$T$21,F34)","v":3},{"$f":"G34/SUM(G$33:G$36)","v":0.13043478260869565}]
["不满足要求",{"$nulls":4},0,{"$f":"COUNTIF($B$4:$T$21,F35)","v":0},{"$f":"G35/SUM(G$33:G$36)","v":0}]
["尚未开始",{"$nulls":4},"NY","/","/"]
["非本次评估范围",{"$nulls":4},"/","/","/"]

{"sheet":"P1","index":2,"n_rows":37,"n_cols":32,"rows_kept":37,"cut":false,"hidden":false,"merged":[[36,0,36,4],[36,7,36,8],[33,0,33,4],[33,7,33,8],[34,0,34,4],[34,7,34,8],[35,0,35,4],[35,7,35,8],[28,0,28,4],[28,7,28,8],[31,0,31,4],[31,7,31,8],[32,0,32,4],[32,7,32,8],[25,0,25,4],[25,7,25,8],[26,0,26,4],[26,7,26,8],[27,0,27,4],[27,7,27,8],[1,0,2,0],[23,0,23,4],[23,7,23,8],[24,0,24,4],[24,7,24,8]]}
["Practice Characterization"]
["Process Areas","Specific Practices",{"$nulls":18},"Generic Practices"]
[null,"SP1.1","SP1.2","SP1.3","SP1.4","SP1.5","SP1.6","SP1.7","SP2.1","SP2.2","SP2.3","SP2.4","SP2.5","SP2.6","SP2.7","SP3.1","SP3.2","SP3.3","SP3.4","SP3.5","GP2.1","GP2.2","GP2.3","GP2.4","GP2.5","GP2.6","GP2.7","GP2.8","GP2.9","GP2.10","GP3.1","GP3.2"]
["REQM",1,1,1,0.5,1,"---","---","---","---","---","---","---","---","---","---","---","---","---","---",1,1,1,1,1,1,1,1,1,1,1,1]
["PP",1,1,1,1,"---","---","---",1,1,1,1,1,1,1,1,1,1,"---","---",1,1,1,1,1,1,1,1,1,1,1,1]
["PMC",1,1,1,1,1,1,1,1,1,1,"---","---","---","---","---","---","---","---","---",1,1,1,1,1,1,1,1,1,1,1,1]
["SAM","/","/","/","---","---","---","---","/","/","/","---","---","---","---","---","---","---","---","---","/","/","/","/","/","/","/","/","/","/","/","/"]
["MA",1,1,1,1,"---","---","---",1,1,1,1,"---","---","---","---","---","---","---","---",1,1,1,1,1,1,1,1,1,1,1,1]
["PPQA",1,1,"---","---","---","---","---",1,1,"---","---","---","---","---","---","---","---","---","---",1,1,1,1,1,1,1,1,1,0.5,1,1]
["CM",1,1,1,"---","---","---","---",1,1,"---","---","---","---","---",1,1,"---","---","---",1,1,1,1,1,1,1,1,1,1,1,1]
["RD",1,1,"---","---","---","---","---",1,1,1,"---","---","---","---",1,1,1,1,1,1,1,1,1,1,1,1,1,1,1,1,1]
["TS",1,1,"---","---","---","---","---",1,1,1,1,"---","---","---",1,1,"---","---","---",1,1,1,1,1,1,1,1,1,1,1,1]
["PI",1,1,1,"---","---","---","---",1,1,"---","---","---","---","---",1,0.5,0.5,1,"---",1,1,1,1,1,1,1,1,1,1,1,1]
["VER",1,1,1,"---","---","---","---",1,1,1,"---","---","---","---",0.5,0,"---","---","---",1,1,1,1,1,1,1,1,1,1,1,1]
["VAL",1,1,"NY","---","---","---","---","NY","NY","---","---","---","---","---","---","---","---","---","---",1,1,1,1,1,1,1,1,1,1,1,1]
["OPF","/","/","/","---","---","---","---","/","/","---","---","---","---","---","/","/","/","/","---","/","/","/","/","/","/","/","/","/","/","/","/"]
["OPD","/","/","/","/","/","/","/","---","---","---","---","---","---","---","---","---","---","---","---","/","/","/","/","/","/","/","/","/","/","/","/"]
["OT","/","/","/","/","---","---","---","/","/","/","---","---","---","---","---","---","---","---","---","/","/","/","/","/","/","/","/","/","/","/","/"]
["IPM",1,1,1,1,1,1,"NY",1,1,1,"---","---","---","---","---","---","---","---","---",1,1,1,1,1,1,1,1,1,1,1,1]
["RSKM",1,1,1,"---","---","---","---",1,1,"---","---","---","---","---",1,1,"---","---","---",1,1,1,1,1,1,1,1,1,1,1,1]
["DAR",1,1,1,1,1,1,"---","---","---","---","---","---","---","---","---","---","---","---","---",1,1,1,1,1,1,1,1,1,1,1,1]
[]
["SP&GP:",{"$nulls":11},"说明：此页为项目1预评估情况。"]
["等级",{"$nulls":4},"分值","个数","占比"]
["完全满足要求",{"$nulls":4},1,{"$f":"COUNTIF($B$4:$AF$21,F25)","v":269},{"$f":"G25/SUM(G$25:G$27)","v":0.97818181818181815}]
["部分满足要求",{"$nulls":4},0.5,{"$f":"COUNTIF($B$4:$AF$21,F26)","v":5},{"$f":"G26/SUM(G$25:G$27)","v":1.8181818181818181E-2}]
["不满足要求",{"$nulls":4},0,{"$f":"COUNTIF($B$4:$AF$21,F27)","v":1},{"$f":"G27/SUM(G$25:G$27)","v":3.6363636363636364E-3}]
["尚未开始",{"$nulls":4},"NY","/","/"]
["非本次评估范围",{"$nulls":4},"/","/","/"]
[]
["SP:"]
["等级",{"$nulls":4},"分值","个数","占比"]
["完全满足要求",{"$nulls":4},1,{"$f":"COUNTIF($B$4:$T$21,F33)","v":102},{"$f":"G33/SUM(G$33:G$36)","v":0.95327102803738317}]
["部分满足要求",{"$nulls":4},0.5,{"$f":"COUNTIF($B$4:$T$21,F34)","v":4},{"$f":"G34/SUM(G$33:G$36)","v":3.7383177570093455E-2}]
["不满足要求",{"$nulls":4},0,{"$f":"COUNTIF($B$4:$T$21,F35)","v":1},{"$f":"G35/SUM(G$33:G$36)","v":9.3457943925233638E-3}]
["尚未开始",{"$nulls":4},"NY","/","/"]
["非本次评估范围",{"$nulls":4},"/","/","/"]

{"sheet":"P2","index":3,"n_rows":37,"n_cols":32,"rows_kept":37,"cut":false,"hidden":false,"merged":[[36,0,36,4],[36,7,36,8],[33,0,33,4],[33,7,33,8],[34,0,34,4],[34,7,34,8],[35,0,35,4],[35,7,35,8],[28,0,28,4],[28,7,28,8],[31,0,31,4],[31,7,31,8],[32,0,32,4],[32,7,32,8],[25,0,25,4],[25,7,25,8],[26,0,26,4],[26,7,26,8],[27,0,27,4],[27,7,27,8],[1,0,2,0],[23,0,23,4],[23,7,23,8],[24,0,24,4],[24,7,24,8]]}
["Practice Characterization"]
["Process Areas","Specific Practices",{"$nulls":18},"Generic Practices"]
[null,"SP1.1","SP1.2","SP1.3","SP1.4","SP1.5","SP1.6","SP1.7","SP2.1","SP2.2","SP2.3","SP2.4","SP2.5","SP2.6","SP2.7","SP3.1","SP3.2","SP3.3","SP3.4","SP3.5","GP2.1","GP2.2","GP2.3","GP2.4","GP2.5","GP2.6","GP2.7","GP2.8","GP2.9","GP2.10","GP3.1","GP3.2"]
["REQM",1,0.5,0.5,0.5,0,"---","---","---","---","---","---","---","---","---","---","---","---","---","---",1,0.5,0.5,0.5,1,1,0.5,0.5,1,0.5,1,1]
["PP",0.5,0.5,1,0.5,"---","---","---",0.5,1,1,1,1,0,1,0,1,0,"---","---",1,1,1,1,1,1,0,0,1,0,1,1]
["PMC",0.5,0.5,1,0.5,0.5,0,0,1,1,1,"---","---","---","---","---","---","---","---","---",1,0.5,0.5,0.5,1,0.5,0.5,0.5,1,0.5,1,1]
["SAM","/","/","/","---","---","---","---","/","/","/","---","---","---","---","---","---","---","---","---","/","/","/","/","/","/","/","/","/","/","/","/"]
["MA",1,1,1,1,"---","---","---",0,0,0.5,0,"---","---","---","---","---","---","---","---",1,0.5,0.5,0.5,1,0.5,0.5,0.5,1,0.5,1,1]
["PPQA",1,1,"---","---","---","---","---",1,1,"---","---","---","---","---","---","---","---","---","---",1,1,1,1,1,1,1,1,1,0.5,1,1]
["CM",1,1,0,"---","---","---","---",1,0,"---","---","---","---","---",0,0,"---","---","---",1,0.5,0.5,0.5,1,0.5,0.5,0.5,1,0.5,1,1]
["RD",1,1,"---","---","---","---","---",1,1,1,"---","---","---","---",1,1,0,0,0,1,0.5,0.5,0.5,1,0.5,0.5,0.5,1,0.5,1,1]
["TS",0,0,"---","---","---","---","---",1,1,1,1,"---","---","---",1,1,"---","---","---",1,0.5,0.5,0.5,1,0.5,0.5,0.5,1,0.5,1,1]
["PI",1,1,1,"---","---","---","---",0,0,"---","---","---","---","---",0,0.5,0,1,"---",1,0.5,0.5,0.5,1,0.5,0.5,0.5,1,0.5,1,1]
["VER",1,1,1,"---","---","---","---",0,0,0,"---","---","---","---",0,0,"---","---","---",1,0.5,0.5,0.5,1,0.5,0.5,0.5,1,0.5,1,1]
["VAL",1,1,0,"---","---","---","---",0,0,"---","---","---","---","---","---","---","---","---","---",1,0.5,0.5,0.5,1,0.5,0.5,0.5,1,0.5,1,1]
["OPF","/","/","/","---","---","---","---","/","/","---","---","---","---","---","/","/","/","/","---","/","/","/","/","/","/","/","/","/","/","/","/"]
["OPD","/","/","/","/","/","/","/","---","---","---","---","---","---","---","---","---","---","---","---","/","/","/","/","/","/","/","/","/","/","/","/"]
["OT","/","/","/","/","---","---","---","/","/","/","---","---","---","---","---","---","---","---","---","/","/","/","/","/","/","/","/","/","/","/","/"]
["IPM",1,1,1,1,0.5,1,0,1,1,1,"---","---","---","---","---","---","---","---","---",1,0.5,0.5,0.5,1,0.5,0.5,0.5,1,0.5,1,1]
["RSKM",1,1,1,"---","---","---","---",1,1,"---","---","---","---","---",1,1,"---","---","---",1,0.5,0.5,0.5,1,0.5,0.5,0.5,1,0.5,1,1]
["DAR",1,0,0,0,0,0,"---","---","---","---","---","---","---","---","---","---","---","---","---",1,0.5,0.5,0.5,1,0.5,0.5,0.5,1,0.5,1,1]
[]
["SP&GP:",{"$nulls":11},"说明：此页为项目2预评估情况。"]
["等级",{"$nulls":4},"分值","个数","占比"]
["完全满足要求",{"$nulls":4},1,{"$f":"COUNTIF($B$4:$AF$21,F25)","v":142},{"$f":"G25/SUM(G$25:G$27)","v":0.50896057347670254}]
["部分满足要求",{"$nulls":4},0.5,{"$f":"COUNTIF($B$4:$AF$21,F26)","v":98},{"$f":"G26/SUM(G$25:G$27)","v":0.35125448028673834}]
["不满足要求",{"$nulls":4},0,{"$f":"COUNTIF($B$4:$AF$21,F27)","v":39},{"$f":"G27/SUM(G$25:G$27)","v":0.13978494623655913}]
["尚未开始",{"$nulls":4},"NY","/","/"]
["非本次评估范围",{"$nulls":4},"/","/","/"]
[]
["SP:"]
["等级",{"$nulls":4},"分值","个数","占比"]
["完全满足要求",{"$nulls":4},1,{"$f":"COUNTIF($B$4:$T$21,F33)","v":61},{"$f":"G33/SUM(G$33:G$36)","v":0.5495495495495496}]
["部分满足要求",{"$nulls":4},0.5,{"$f":"COUNTIF($B$4:$T$21,F34)","v":14},{"$f":"G34/SUM(G$33:G$36)","v":0.12612612612612611}]
["不满足要求",{"$nulls":4},0,{"$f":"COUNTIF($B$4:$T$21,F35)","v":36},{"$f":"G35/SUM(G$33:G$36)","v":0.32432432432432434}]
["尚未开始",{"$nulls":4},"NY","/","/"]
["非本次评估范围",{"$nulls":4},"/","/","/"]

{"sheet":"P3","index":4,"n_rows":37,"n_cols":32,"rows_kept":37,"cut":false,"hidden":true,"merged":[[36,0,36,4],[36,7,36,8],[33,0,33,4],[33,7,33,8],[34,0,34,4],[34,7,34,8],[35,0,35,4],[35,7,35,8],[28,0,28,4],[28,7,28,8],[31,0,31,4],[31,7,31,8],[32,0,32,4],[32,7,32,8],[25,0,25,4],[25,7,25,8],[26,0,26,4],[26,7,26,8],[27,0,27,4],[27,7,27,8],[1,0,2,0],[23,0,23,4],[23,7,23,8],[24,0,24,4],[24,7,24,8]]}
["Practice Characterization"]
["Process Areas","Specific Practices",{"$nulls":18},"Generic Practices"]
[null,"SP1.1","SP1.2","SP1.3","SP1.4","SP1.5","SP1.6","SP1.7","SP2.1","SP2.2","SP2.3","SP2.4","SP2.5","SP2.6","SP2.7","SP3.1","SP3.2","SP3.3","SP3.4","SP3.5","GP2.1","GP2.2","GP2.3","GP2.4","GP2.5","GP2.6","GP2.7","GP2.8","GP2.9","GP2.10","GP3.1","GP3.2"]
["REQM",1,0,0,0,0,"---","---","---","---","---","---","---","---","---","---","---","---","---","---",1,0.5,0.5,0.5,0,0,0.5,0.5,0,0.5,0,0]
["PP",0.5,1,0,0.5,"---","---","---",0.5,1,0,0.5,0,0.5,0.5,0,0,0,"---","---",1,1,1,1,1,1,1,1,0,0,0,0]
["PMC",0.5,1,1,0,1,0,0,0,0,0,"---","---","---","---","---","---","---","---","---",1,0.5,0.5,0.5,0,0,0.5,0.5,0,0.5,0,0]
["SAM","/","/","/","---","---","---","---","/","/","/","---","---","---","---","---","---","---","---","---","/","/","/","/",0,"/","/","/","/","/","/","/"]
["MA",0,0,0,0,"---","---","---",0,0,0,0,"---","---","---","---","---","---","---","---",1,0.5,0.5,0.5,0,0,0.5,0.5,0,0.5,0,0]
["PPQA",0,0,"---","---","---","---","---",0,0,"---","---","---","---","---","---","---","---","---","---",1,0.5,0.5,0.5,0,0,0.5,0.5,0,0.5,0,0]
["CM",0,0,0,"---","---","---","---",0,0,"---","---","---","---","---",0,0,"---","---","---",1,0.5,0.5,0.5,0,0,0.5,0.5,0,0.5,0,0]
["RD",1,1,"---","---","---","---","---",0.5,0,0,"---","---","---","---",0,0,0,0,0,1,0.5,0.5,0.5,0,0,0.5,0.5,0,0.5,0,0]
["TS",0,0,"---","---","---","---","---",1,1,1,0,"---","---","---",1,1,"---","---","---",1,0.5,0.5,0.5,0,0,0.5,0.5,0,0.5,0,0]
["PI",0,0,0,"---","---","---","---",0,0,"---","---","---","---","---",0,0,0,1,"---",1,0.5,0.5,0.5,0,0,0.5,0.5,0,0.5,0,0]
["VER",0,0,0,"---","---","---","---",0,0,0,"---","---","---","---",1,1,"---","---","---",1,0.5,0.5,0.5,0,0,0.5,0.5,0,0.5,0,0]
["VAL",0,0,0,"---","---","---","---",0,0,"---","---","---","---","---","---","---","---","---","---",1,0.5,0.5,0.5,0,0,0.5,0.5,0,0.5,0,0]
["OPF","/","/","/","---","---","---","---","/","/","---","---","---","---","---","/","/","/","/","---","/","/","/","/","/","/","/","/","/","/","/","/"]
["OPD","/","/","/","/","/","/","/","---","---","---","---","---","---","---","---","---","---","---","---","/","/","/","/","/","/","/","/","/","/","/","/"]
["OT","/","/","/","/","---","---","---","/","/","/","---","---","---","---","---","---","---","---","---","/","/","/","/","/","/","/","/","/","/","/","/"]
["IPM",0,0,0,0.5,0.5,0.5,0,0,0,0,"---","---","---","---","---","---","---","---","---",1,0.5,0.5,0.5,0,0,0.5,0.5,0,0.5,0,0]
["RSKM",1,1,0,"---","---","---","---",1,1,"---","---","---","---","---",1,1,"---","---","---",1,0.5,0.5,0.5,0,0,0.5,0.5,0,0.5,0,0]
["DAR",1,0,0,0,0,0,"---","---","---","---","---","---","---","---","---","---","---","---","---",1,0.5,0.5,0.5,0,0,0.5,0.5,0,0.5,0,0]
[]
["SP&GP:",{"$nulls":11},"说明：此页为项目3预评估情况。"]
["等级",{"$nulls":4},"分值","个数","占比"]
["完全满足要求",{"$nulls":4},1,{"$f":"COUNTIF($B$4:$AF$21,F25)","v":44},{"$f":"G25/SUM(G$25:G$27)","v":0.15714285714285714}]
["部分满足要求",{"$nulls":4},0.5,{"$f":"COUNTIF($B$4:$AF$21,F26)","v":89},{"$f":"G26/SUM(G$25:G$27)","v":0.31785714285714284}]
["不满足要求",{"$nulls":4},0,{"$f":"COUNTIF($B$4:$AF$21,F27)","v":147},{"$f":"G27/SUM(G$25:G$27)","v":0.52500000000000002}]
["尚未开始",{"$nulls":4},"NY","/","/"]
["非本次评估范围",{"$nulls":4},"/","/","/"]
[]
["SP:"]
["等级",{"$nulls":4},"分值","个数","占比"]
["完全满足要求",{"$nulls":4},1,{"$f":"COUNTIF($B$4:$T$21,F33)","v":23},{"$f":"G33/SUM(G$33:G$36)","v":0.2072072072072072}]
["部分满足要求",{"$nulls":4},0.5,{"$f":"COUNTIF($B$4:$T$21,F34)","v":11},{"$f":"G34/SUM(G$33:G$36)","v":9.90990990990991E-2}]
["不满足要求",{"$nulls":4},0,{"$f":"COUNTIF($B$4:$T$21,F35)","v":77},{"$f":"G35/SUM(G$33:G$36)","v":0.69369369369369371}]
["尚未开始",{"$nulls":4},"NY","/","/"]
["非本次评估范围",{"$nulls":4},"/","/","/"]